Target
Tyrosine-protein phosphatase non-receptor type 7
Ligand
BDBM54792
Substrate
Meas. Tech.
SAR analysis of compounds that inhibit HePTP - Set 2
IC50
32300±n/a nM
Citation
 PubChem, PC SAR analysis of compounds that inhibit HePTP - Set 2 PubChem Bioassay (2010)[AID] 
Target
Name:
Tyrosine-protein phosphatase non-receptor type 7
Synonyms:
He-PTP Hematopoietic protein-tyrosine phosphatase (HEPTP) PTPN7 Tyrosine-protein phosphatase non-receptor type 7 | Tyrosine-protein phosphatase non-receptor type 7 (HEPTP)
Type:
Protein
Mol. Mass.:
40530.79
Organism:
Homo sapiens (Human)
Description:
P35236
Residue:
360
  
Inhibitor
Name:
BDBM54792
Synonyms:
2-(3-cyano-5,8-dimethyl-quinolin-2-yl)sulfanyl-N-(2-ethyl-6-methyl-phenyl)ethanamide 2-[(3-cyano-5,8-dimethyl-2-quinolinyl)thio]-N-(2-ethyl-6-methylphenyl)acetamide CHEMBL1713374 cid_1450182
Type:
Small organic molecule
Emp. Form.:
C23H23N3OS
Mol. Mass.:
389.513
SMILES:
CCc1cccc(C)c1NC(=O)CSc1nc2c(C)ccc(C)c2cc1C#N
: