Target
Tyrosine-protein phosphatase non-receptor type 7
Ligand
BDBM46267
Substrate
Meas. Tech.
SAR analysis of compounds that inhibit HePTP - Set 2
IC50
3610±n/a nM
Citation
 PubChem, PC SAR analysis of compounds that inhibit HePTP - Set 2 PubChem Bioassay (2010)[AID] 
Target
Name:
Tyrosine-protein phosphatase non-receptor type 7
Synonyms:
He-PTP Hematopoietic protein-tyrosine phosphatase (HEPTP) PTPN7 Tyrosine-protein phosphatase non-receptor type 7 | Tyrosine-protein phosphatase non-receptor type 7 (HEPTP)
Type:
Protein
Mol. Mass.:
40530.79
Organism:
Homo sapiens (Human)
Description:
P35236
Residue:
360
  
Inhibitor
Name:
BDBM46267
Synonyms:
2-[2-chloranyl-6-methoxy-4-[(Z)-[3-[2-[(3-methylphenyl)amino]-2-oxidanylidene-ethyl]-2,4-bis(oxidanylidene)-1,3-thiazolidin-5-ylidene]methyl]phenoxy]ethanoic acid 2-[2-chloro-6-methoxy-4-[(Z)-[3-[2-(3-methylanilino)-2-oxoethyl]-2,4-dioxo-1,3-thiazolidin-5-ylidene]methyl]phenoxy]acetic acid MLS-0425580.0001 | cid_2260301
Type:
Small organic molecule
Emp. Form.:
C22H19ClN2O7S
Mol. Mass.:
490.913
SMILES:
COc1cc(\C=C2/SC(=O)N(CC(=O)Nc3cccc(C)c3)C2=O)cc(Cl)c1OCC(O)=O
: