Target
Tyrosine-protein phosphatase non-receptor type 7
Ligand
BDBM46271
Substrate
Meas. Tech.
SAR analysis of compounds that inhibit HePTP - Set 2
IC50
1400±n/a nM
Citation
 PubChem, PC SAR analysis of compounds that inhibit HePTP - Set 2 PubChem Bioassay (2010)[AID] 
Target
Name:
Tyrosine-protein phosphatase non-receptor type 7
Synonyms:
He-PTP Hematopoietic protein-tyrosine phosphatase (HEPTP) PTPN7 Tyrosine-protein phosphatase non-receptor type 7 | Tyrosine-protein phosphatase non-receptor type 7 (HEPTP)
Type:
Protein
Mol. Mass.:
40530.79
Organism:
Homo sapiens (Human)
Description:
P35236
Residue:
360
  
Inhibitor
Name:
BDBM46271
Synonyms:
2-[2-chloro-6-ethoxy-4-[(E)-[2-(4-fluoroanilino)-4-keto-2-thiazolin-5-ylidene]methyl]phenoxy]acetic acid ethyl ester MLS-0425586.0001 ethyl 2-[2-chloranyl-6-ethoxy-4-[(E)-[2-[(4-fluorophenyl)amino]-4-oxidanylidene-1,3-thiazol-5-ylidene]methyl]phenoxy]ethanoate | ethyl 2-[2-chloro-6-ethoxy-4-[(E)-[2-(4-fluoroanilino)-4-oxo-1,3-thiazol-5-ylidene]methyl]phenoxy]acetate
Type:
Small organic molecule
Emp. Form.:
C22H20ClFN2O5S
Mol. Mass.:
478.921
SMILES:
CCOC(=O)COc1c(Cl)cc(C=C2SC(Nc3ccc(F)cc3)=NC2=O)cc1OCC
: