Target
Tyrosine-protein phosphatase non-receptor type 7
Ligand
BDBM61646
Substrate
Meas. Tech.
SAR analysis of compounds that inhibit HePTP - Set 2
IC50
1890±n/a nM
Citation
 PubChem, PC SAR analysis of compounds that inhibit HePTP - Set 2 PubChem Bioassay (2010)[AID] 
Target
Name:
Tyrosine-protein phosphatase non-receptor type 7
Synonyms:
He-PTP Hematopoietic protein-tyrosine phosphatase (HEPTP) PTPN7 Tyrosine-protein phosphatase non-receptor type 7 | Tyrosine-protein phosphatase non-receptor type 7 (HEPTP)
Type:
Protein
Mol. Mass.:
40530.79
Organism:
Homo sapiens (Human)
Description:
P35236
Residue:
360
  
Inhibitor
Name:
BDBM61646
Synonyms:
4-[4-(5-Benzylidene-4-oxo-2-thioxo-thiazolidin-3-yl)-butyrylamino]-benzoic acid 4-[4-[(5E)-5-benzal-4-keto-2-thioxo-thiazolidin-3-yl]butanoylamino]benzoic acid 4-[[1-oxo-4-[(5E)-4-oxo-5-(phenylmethylene)-2-sulfanylidene-3-thiazolidinyl]butyl]amino]benzoic acid SMR000608142 | cid_1416931
Type:
Small organic molecule
Emp. Form.:
C21H18N2O4S2
Mol. Mass.:
426.509
SMILES:
OC(=O)c1ccc(NC(=O)CCCN2C(=S)S\C(=C\c3ccccc3)C2=O)cc1
: