Target
Tyrosine-protein phosphatase non-receptor type 7
Ligand
BDBM75357
Substrate
Meas. Tech.
SAR analysis of compounds that inhibit HePTP - Set 2
IC50
100000±n/a nM
Citation
 PubChem, PC SAR analysis of compounds that inhibit HePTP - Set 2 PubChem Bioassay (2010)[AID] 
Target
Name:
Tyrosine-protein phosphatase non-receptor type 7
Synonyms:
He-PTP Hematopoietic protein-tyrosine phosphatase (HEPTP) PTPN7 Tyrosine-protein phosphatase non-receptor type 7 | Tyrosine-protein phosphatase non-receptor type 7 (HEPTP)
Type:
Protein
Mol. Mass.:
40530.79
Organism:
Homo sapiens (Human)
Description:
P35236
Residue:
360
  
Inhibitor
Name:
BDBM75357
Synonyms:
MLS-0435607.0001 [4-amino-3-(5-chloro-2-methoxyphenyl)-2-sulfanylidene-1,3-thiazol-5-yl]-morpholin-4-ylmethanone [4-azanyl-3-(5-chloranyl-2-methoxy-phenyl)-2-sulfanylidene-1,3-thiazol-5-yl]-morpholin-4-yl-methanone | cid_42585970
Type:
Small organic molecule
Emp. Form.:
C15H16ClN3O3S2
Mol. Mass.:
385.889
SMILES:
COc1ccc(Cl)cc1-n1c(N)c(sc1=S)C(=O)N1CCOCC1
: