Target
Tyrosine-protein phosphatase non-receptor type 7
Ligand
BDBM46210
Substrate
Meas. Tech.
SAR analysis of compounds that inhibit HePTP - Set 2
IC50
100000±n/a nM
Citation
 PubChem, PC SAR analysis of compounds that inhibit HePTP - Set 2 PubChem Bioassay (2010)[AID] 
Target
Name:
Tyrosine-protein phosphatase non-receptor type 7
Synonyms:
He-PTP Hematopoietic protein-tyrosine phosphatase (HEPTP) PTPN7 Tyrosine-protein phosphatase non-receptor type 7 | Tyrosine-protein phosphatase non-receptor type 7 (HEPTP)
Type:
Protein
Mol. Mass.:
40530.79
Organism:
Homo sapiens (Human)
Description:
P35236
Residue:
360
  
Inhibitor
Name:
BDBM46210
Synonyms:
4-(1,3-benzodioxol-5-ylmethyl)-N-(4-sulfamoylphenyl)-1-piperazinecarbothioamide 4-piperonyl-N-(4-sulfamoylphenyl)piperazine-1-carbothioamide cid_1213466
Type:
Small organic molecule
Emp. Form.:
C19H22N4O4S2
Mol. Mass.:
434.532
SMILES:
NS(=O)(=O)c1ccc(NC(=S)N2CCN(Cc3ccc4OCOc4c3)CC2)cc1
: