Target
Kappa-type opioid receptor
Ligand
BDBM75392
Substrate
Meas. Tech.
SAR analysis of small molecule agonists of the kappa opioid receptor via a luminescent beta-arrestin assay - Set 3
EC50
>20000±n/a nM
Citation
 PubChem, PC SAR analysis of small molecule agonists of the kappa opioid receptor via a luminescent beta-arrestin assay - Set 3 PubChem Bioassay (2010)[AID] 
Target
Name:
Kappa-type opioid receptor
Synonyms:
K-OR-1 Kappa-opioid receptor (KOR) Kappa-type opioid receptor (KOR) OPIATE Kappa OPRK1 kappa opioid receptor (KOR)
Type:
G Protein-Coupled Receptor (GPCR)
Mol. Mass.:
42648.76
Organism:
Homo sapiens (Human)
Description:
P41145
Residue:
380
  
Inhibitor
Name:
BDBM75392
Synonyms:
KSC-5-289E5 [4-[[5-pyridin-2-yl-4-(thiophen-2-ylmethyl)-1,2,4-triazol-3-yl]sulfanylmethyl]phenyl] acetate acetic acid [4-[[[5-(2-pyridinyl)-4-(thiophen-2-ylmethyl)-1,2,4-triazol-3-yl]thio]methyl]phenyl] ester cid_44620931
Type:
Small organic molecule
Emp. Form.:
C21H18N4O2S2
Mol. Mass.:
422.523
SMILES:
CC(=O)Oc1ccc(CSc2nnc(-c3ccccn3)n2Cc2cccs2)cc1
: