Target
Kappa-type opioid receptor
Ligand
BDBM75401
Substrate
Meas. Tech.
SAR analysis of small molecule agonists of the kappa opioid receptor via a luminescent beta-arrestin assay - Set 3
EC50
4460±n/a nM
Citation
 PubChem, PC SAR analysis of small molecule agonists of the kappa opioid receptor via a luminescent beta-arrestin assay - Set 3 PubChem Bioassay (2010)[AID] 
Target
Name:
Kappa-type opioid receptor
Synonyms:
K-OR-1 Kappa-opioid receptor (KOR) Kappa-type opioid receptor (KOR) OPIATE Kappa OPRK1 kappa opioid receptor (KOR)
Type:
G Protein-Coupled Receptor (GPCR)
Mol. Mass.:
42648.76
Organism:
Homo sapiens (Human)
Description:
P41145
Residue:
380
  
Inhibitor
Name:
BDBM75401
Synonyms:
2-[5-[[4-fluoranyl-2-(trifluoromethyl)phenyl]methylsulfanyl]-4-(thiophen-2-ylmethyl)-1,2,4-triazol-3-yl]pyridine 2-[5-[[4-fluoro-2-(trifluoromethyl)phenyl]methylsulfanyl]-4-(thiophen-2-ylmethyl)-1,2,4-triazol-3-yl]pyridine KSC-5-289H2 cid_44620911
Type:
Small organic molecule
Emp. Form.:
C20H14F4N4S2
Mol. Mass.:
450.476
SMILES:
Fc1ccc(CSc2nnc(-c3ccccn3)n2Cc2cccs2)c(c1)C(F)(F)F
: