Target
Kappa-type opioid receptor
Ligand
BDBM54788
Substrate
Meas. Tech.
SAR analysis of small molecule agonists of the kappa opioid receptor via a luminescent beta-arrestin assay - Set 3
EC50
8380±n/a nM
Citation
 PubChem, PC SAR analysis of small molecule agonists of the kappa opioid receptor via a luminescent beta-arrestin assay - Set 3 PubChem Bioassay (2010)[AID] 
Target
Name:
Kappa-type opioid receptor
Synonyms:
K-OR-1 Kappa-opioid receptor (KOR) Kappa-type opioid receptor (KOR) OPIATE Kappa OPRK1 kappa opioid receptor (KOR)
Type:
G Protein-Coupled Receptor (GPCR)
Mol. Mass.:
42648.76
Organism:
Homo sapiens (Human)
Description:
P41145
Residue:
380
  
Inhibitor
Name:
BDBM54788
Synonyms:
MLS000778656 N-butyl-N-[(6-methyl-2-oxidanylidene-1H-quinolin-3-yl)methyl]pyridine-2-carboxamide N-butyl-N-[(6-methyl-2-oxo-1H-quinolin-3-yl)methyl]pyridine-2-carboxamide SMR000415450 | cid_1636023
Type:
Small organic molecule
Emp. Form.:
C21H23N3O2
Mol. Mass.:
349.4262
SMILES:
CCCCN(Cc1cc2cc(C)ccc2[nH]c1=O)C(=O)c1ccccn1
: