Target
Kappa-type opioid receptor
Ligand
BDBM75414
Substrate
Meas. Tech.
SAR analysis of small molecule agonists of the kappa opioid receptor via a luminescent beta-arrestin assay - Set 3
EC50
>20000±n/a nM
Citation
 PubChem, PC SAR analysis of small molecule agonists of the kappa opioid receptor via a luminescent beta-arrestin assay - Set 3 PubChem Bioassay (2010)[AID] 
Target
Name:
Kappa-type opioid receptor
Synonyms:
K-OR-1 Kappa-opioid receptor (KOR) Kappa-type opioid receptor (KOR) OPIATE Kappa OPRK1 kappa opioid receptor (KOR)
Type:
G Protein-Coupled Receptor (GPCR)
Mol. Mass.:
42648.76
Organism:
Homo sapiens (Human)
Description:
P41145
Residue:
380
  
Inhibitor
Name:
BDBM75414
Synonyms:
2-[5-(benzylthio)-4-(3-pyridylmethyl)-1,2,4-triazol-3-yl]pyridine 2-[5-(phenylmethylthio)-4-(3-pyridinylmethyl)-1,2,4-triazol-3-yl]pyridine KSC-12-171-A4 cid_45479177
Type:
Small organic molecule
Emp. Form.:
C20H17N5S
Mol. Mass.:
359.447
SMILES:
C(Sc1nnc(-c2ccccn2)n1Cc1cccnc1)c1ccccc1
: