Target
Kappa-type opioid receptor
Ligand
BDBM75428
Substrate
Meas. Tech.
SAR analysis of small molecule agonists of the kappa opioid receptor via a luminescent beta-arrestin assay - Set 3
EC50
11800±n/a nM
Citation
 PubChem, PC SAR analysis of small molecule agonists of the kappa opioid receptor via a luminescent beta-arrestin assay - Set 3 PubChem Bioassay (2010)[AID] 
Target
Name:
Kappa-type opioid receptor
Synonyms:
K-OR-1 Kappa-opioid receptor (KOR) Kappa-type opioid receptor (KOR) OPIATE Kappa OPRK1 kappa opioid receptor (KOR)
Type:
G Protein-Coupled Receptor (GPCR)
Mol. Mass.:
42648.76
Organism:
Homo sapiens (Human)
Description:
P41145
Residue:
380
  
Inhibitor
Name:
BDBM75428
Synonyms:
2-[4-(2-chlorobenzyl)-5-[(3,4-dichlorobenzyl)thio]-1,2,4-triazol-3-yl]pyridine 2-[4-[(2-chlorophenyl)methyl]-5-[(3,4-dichlorophenyl)methylthio]-1,2,4-triazol-3-yl]pyridine KUC105590N | cid_45479194
Type:
Small organic molecule
Emp. Form.:
C21H15Cl3N4S
Mol. Mass.:
461.795
SMILES:
Clc1ccc(CSc2nnc(-c3ccccn3)n2Cc2ccccc2Cl)cc1Cl
: