Target
Integrin alpha-4
Ligand
BDBM47938
Substrate
Meas. Tech.
Dose Response of primary screening hit compounds for Identification of VLA-4 Allosteric Modulators
EC50
>30000±n/a nM
Citation
 PubChem, PC Dose Response of primary screening hit compounds for Identification of VLA-4 Allosteric Modulators PubChem Bioassay (2010)[AID] 
Target
Name:
Integrin alpha-4
Synonyms:
CD49 antigen-like family member D CD49d antigen ITA4_HUMAN Integrin alpha-4 Integrin alpha-IV VLA-4 integrin alpha 4 precursor | integrin alpha-4 precursor
Type:
Membrane Protein
Mol. Mass.:
114897.35
Organism:
Homo sapiens (Human)
Description:
P13612
Residue:
1032
  
Inhibitor
Name:
BDBM47938
Synonyms:
(4'S)-2'-(4-chlorophenyl)-1'-cyano-4'-(2-keto-2-methoxy-ethyl)spiro[fluorene-9,3'-pyrazolidine]-4'-carboxylic acid methyl ester MLS000550560 cid_6552076 methyl (4'S)-2'-(4-chlorophenyl)-1'-cyano-4'-(2-methoxy-2-oxoethyl)spiro[fluorene-9,3'-pyrazolidine]-4'-carboxylate | methyl 1-(4-chlorophenyl)-2-cyano-4-(2-methoxy-2-oxoethyl)spiro[pyrazolidine-5,9'-(9'H)-fluorene]-4-carboxylate
Type:
Small organic molecule
Emp. Form.:
C27H22ClN3O4
Mol. Mass.:
487.934
SMILES:
COC(=O)C[C@@]1(CN(C#N)N(c2ccc(Cl)cc2)C11c2ccccc2-c2ccccc12)C(=O)OC
: