Target
Integrin alpha-4
Ligand
BDBM61009
Substrate
Meas. Tech.
Dose Response of primary screening hit compounds for Identification of VLA-4 Allosteric Modulators
EC50
3150±n/a nM
Citation
 PubChem, PC Dose Response of primary screening hit compounds for Identification of VLA-4 Allosteric Modulators PubChem Bioassay (2010)[AID] 
Target
Name:
Integrin alpha-4
Synonyms:
CD49 antigen-like family member D CD49d antigen ITA4_HUMAN Integrin alpha-4 Integrin alpha-IV VLA-4 integrin alpha 4 precursor | integrin alpha-4 precursor
Type:
Membrane Protein
Mol. Mass.:
114897.35
Organism:
Homo sapiens (Human)
Description:
P13612
Residue:
1032
  
Inhibitor
Name:
BDBM61009
Synonyms:
(1aS,3aS,6aS,6bR)-5,5,6b-trimethyl-3a,4,6,6a-tetrahydro-1H-cycloprop[e]indene-1a,2-dicarbaldehyde (1aS,3aS,6aS,6bR)-5,5,6b-trimethyl-3a,4,6,6a-tetrahydro-1H-cyclopropa[e]indene-1a,2-dicarboxaldehyde Isovelleral SMR000127505 marasmane
Type:
Small organic molecule
Emp. Form.:
C15H20O2
Mol. Mass.:
232.3181
SMILES:
C[C@]12C[C@@]1(C=O)C(C=O)=C[C@@H]1CC(C)(C)C[C@H]21
: