Target
Integrin alpha-4
Ligand
BDBM61011
Substrate
Meas. Tech.
Dose Response of primary screening hit compounds for Identification of VLA-4 Allosteric Modulators
EC50
>30000±n/a nM
Citation
 PubChem, PC Dose Response of primary screening hit compounds for Identification of VLA-4 Allosteric Modulators PubChem Bioassay (2010)[AID] 
Target
Name:
Integrin alpha-4
Synonyms:
CD49 antigen-like family member D CD49d antigen ITA4_HUMAN Integrin alpha-4 Integrin alpha-IV VLA-4 integrin alpha 4 precursor | integrin alpha-4 precursor
Type:
Membrane Protein
Mol. Mass.:
114897.35
Organism:
Homo sapiens (Human)
Description:
P13612
Residue:
1032
  
Inhibitor
Name:
BDBM61011
Synonyms:
(3'S,4'R)-1'-(4-chlorophenyl)-2'-cyano-spiro[fluorene-9,5'-pyrazolidine]-3',4'-dicarboxylic acid dimethyl ester MLS000549148 cid_9499902 dimethyl (3'S,4'R)-1'-(4-chlorophenyl)-2'-cyanospiro[fluorene-9,5'-pyrazolidine]-3',4'-dicarboxylate | dimethyl 1-(4-chlorophenyl)-2-cyanospiro[pyrazolidine-5,9'-(9'H)-fluorene]-3,4-dicarboxylate
Type:
Small organic molecule
Emp. Form.:
C26H20ClN3O4
Mol. Mass.:
473.908
SMILES:
COC(=O)[C@@H]1[C@@H](C(=O)OC)C2(N(N1C#N)c1ccc(Cl)cc1)c1ccccc1-c1ccccc21
: