Target
Integrin alpha-4
Ligand
BDBM41056
Substrate
Meas. Tech.
Dose Response of primary screening hit compounds for Identification of VLA-4 Allosteric Modulators
EC50
>30000±n/a nM
Citation
 PubChem, PC Dose Response of primary screening hit compounds for Identification of VLA-4 Allosteric Modulators PubChem Bioassay (2010)[AID] 
Target
Name:
Integrin alpha-4
Synonyms:
CD49 antigen-like family member D CD49d antigen ITA4_HUMAN Integrin alpha-4 Integrin alpha-IV VLA-4 integrin alpha 4 precursor | integrin alpha-4 precursor
Type:
Membrane Protein
Mol. Mass.:
114897.35
Organism:
Homo sapiens (Human)
Description:
P13612
Residue:
1032
  
Inhibitor
Name:
BDBM41056
Synonyms:
2-{4-[2-(1-benzofuran-2-ylcarbonyl)carbohydrazonoyl]-2-chlorophenoxy}-N-phenylacetamide N-[[3-chloranyl-4-(2-oxidanylidene-2-phenylazanyl-ethoxy)phenyl]methylideneamino]-1-benzofuran-2-carboxamide N-[[4-(2-anilino-2-oxoethoxy)-3-chlorophenyl]methylideneamino]-1-benzofuran-2-carboxamide SMR000160815 | cid_1018686
Type:
Small organic molecule
Emp. Form.:
C24H18ClN3O4
Mol. Mass.:
447.87
SMILES:
Clc1cc(C=NNC(=O)c2cc3ccccc3o2)ccc1OCC(=O)Nc1ccccc1
: