Target
Nuclear receptor subfamily 1 group I member 2
Ligand
BDBM75449
Substrate
Meas. Tech.
Luminescence-based counterscreen for activators of the Aryl Hydrocarbon Receptor (AHR): cell-based high throughput dose response screening assay for activators of the Pregnane X Receptor (PXR)
EC50
80577±n/a nM
Citation
 PubChem, PC Luminescence-based counterscreen for activators of the Aryl Hydrocarbon Receptor (AHR): cell-based high throughput dose response screening assay for activators of the Pregnane X Receptor (PXR) PubChem Bioassay (2010)[AID] 
Target
Name:
Nuclear receptor subfamily 1 group I member 2
Synonyms:
NR1I2 Orphan nuclear receptor PAR1 PXR SXR nuclear receptor subfamily 1 group I member 2 isoform 1
Type:
Nuclear receptor
Mol. Mass.:
49774.77
Organism:
Homo sapiens (Human)
Description:
O75469
Residue:
434
  
Inhibitor
Name:
BDBM75449
Synonyms:
MLS000041272 N-(1,7-dimethylpyrazolo[3,4-b]quinolin-3-yl)butanamide SMR000046425 | cid_665305
Type:
Small organic molecule
Emp. Form.:
C16H18N4O
Mol. Mass.:
282.3403
SMILES:
CCCC(=O)Nc1nn(C)c2nc3cc(C)ccc3cc12
: