Target
Nuclear receptor subfamily 1 group I member 2
Ligand
BDBM32292
Substrate
Meas. Tech.
Luminescence-based counterscreen for activators of the Aryl Hydrocarbon Receptor (AHR): cell-based high throughput dose response screening assay for activators of the Pregnane X Receptor (PXR)
EC50
92638±n/a nM
Citation
 PubChem, PC Luminescence-based counterscreen for activators of the Aryl Hydrocarbon Receptor (AHR): cell-based high throughput dose response screening assay for activators of the Pregnane X Receptor (PXR) PubChem Bioassay (2010)[AID] 
Target
Name:
Nuclear receptor subfamily 1 group I member 2
Synonyms:
NR1I2 Orphan nuclear receptor PAR1 PXR SXR nuclear receptor subfamily 1 group I member 2 isoform 1
Type:
Nuclear receptor
Mol. Mass.:
49774.77
Organism:
Homo sapiens (Human)
Description:
O75469
Residue:
434
  
Inhibitor
Name:
BDBM32292
Synonyms:
5-Bromo-nicotinic acid [1-[5-(2-nitro-phenyl)-furan-2-yl]-meth-(E)-ylidene]-hydrazide 5-bromo-N-[[5-(2-nitrophenyl)-2-furanyl]methylideneamino]-3-pyridinecarboxamide 5-bromo-N-[[5-(2-nitrophenyl)furan-2-yl]methylideneamino]pyridine-3-carboxamide SMR000218578 | cid_1914494
Type:
Small organic molecule
Emp. Form.:
C17H11BrN4O4
Mol. Mass.:
415.198
SMILES:
[O-][N+](=O)c1ccccc1-c1ccc([CH+][N-]NC(=O)c2cncc(Br)c2)o1
: