Target
Nuclear receptor subfamily 1 group I member 2
Ligand
BDBM75484
Substrate
Meas. Tech.
Luminescence-based counterscreen for activators of the Aryl Hydrocarbon Receptor (AHR): cell-based high throughput dose response screening assay for activators of the Pregnane X Receptor (PXR)
EC50
>116147±n/a nM
Citation
 PubChem, PC Luminescence-based counterscreen for activators of the Aryl Hydrocarbon Receptor (AHR): cell-based high throughput dose response screening assay for activators of the Pregnane X Receptor (PXR) PubChem Bioassay (2010)[AID] 
Target
Name:
Nuclear receptor subfamily 1 group I member 2
Synonyms:
NR1I2 Orphan nuclear receptor PAR1 PXR SXR nuclear receptor subfamily 1 group I member 2 isoform 1
Type:
Nuclear receptor
Mol. Mass.:
49774.77
Organism:
Homo sapiens (Human)
Description:
O75469
Residue:
434
  
Inhibitor
Name:
BDBM75484
Synonyms:
Benzofuran-2-carboxylic acid [1-(1-prop-2-ynyl-1H-indol-3-yl)-meth-(E)-ylidene]-hydrazide N-[(1-prop-2-ynyl-3-indolyl)methylideneamino]-2-benzofurancarboxamide N-[(1-propargylindol-3-yl)methyleneamino]coumarilamide cid_921858
Type:
Small organic molecule
Emp. Form.:
C21H15N3O2
Mol. Mass.:
341.3627
SMILES:
O=C(NN=Cc1cn(CC#C)c2ccccc12)c1cc2ccccc2o1
: