Target
Nuclear receptor subfamily 1 group I member 2
Ligand
BDBM75487
Substrate
Meas. Tech.
Luminescence-based counterscreen for activators of the Aryl Hydrocarbon Receptor (AHR): cell-based high throughput dose response screening assay for activators of the Pregnane X Receptor (PXR)
EC50
110375±n/a nM
Citation
 PubChem, PC Luminescence-based counterscreen for activators of the Aryl Hydrocarbon Receptor (AHR): cell-based high throughput dose response screening assay for activators of the Pregnane X Receptor (PXR) PubChem Bioassay (2010)[AID] 
Target
Name:
Nuclear receptor subfamily 1 group I member 2
Synonyms:
NR1I2 Orphan nuclear receptor PAR1 PXR SXR nuclear receptor subfamily 1 group I member 2 isoform 1
Type:
Nuclear receptor
Mol. Mass.:
49774.77
Organism:
Homo sapiens (Human)
Description:
O75469
Residue:
434
  
Inhibitor
Name:
BDBM75487
Synonyms:
4-[5-(3,5-Dinitro-phenyl)-[1,2,4]oxadiazol-3-yl]-pyridine 5-(3,5-dinitrophenyl)-3-pyridin-4-yl-1,2,4-oxadiazole SMR000219908 | cid_1422791
Type:
Small organic molecule
Emp. Form.:
C13H7N5O5
Mol. Mass.:
313.2252
SMILES:
[O-][N+](=O)c1cc(cc(c1)[N+]([O-])=O)-c1nc(no1)-c1ccncc1
: