Target
Nuclear receptor subfamily 1 group I member 2
Ligand
BDBM51259
Substrate
Meas. Tech.
Luminescence-based counterscreen for activators of the Aryl Hydrocarbon Receptor (AHR): cell-based high throughput dose response screening assay for activators of the Pregnane X Receptor (PXR)
EC50
>115994±n/a nM
Citation
 PubChem, PC Luminescence-based counterscreen for activators of the Aryl Hydrocarbon Receptor (AHR): cell-based high throughput dose response screening assay for activators of the Pregnane X Receptor (PXR) PubChem Bioassay (2010)[AID] 
Target
Name:
Nuclear receptor subfamily 1 group I member 2
Synonyms:
NR1I2 Orphan nuclear receptor PAR1 PXR SXR nuclear receptor subfamily 1 group I member 2 isoform 1
Type:
Nuclear receptor
Mol. Mass.:
49774.77
Organism:
Homo sapiens (Human)
Description:
O75469
Residue:
434
  
Inhibitor
Name:
BDBM51259
Synonyms:
1H-Benz[de]isoquinoline-1,3(2H)-dione, 5-amino-2-[2-(1-pyrrolidinyl)ethyl]- 5-amino-2-(2-pyrrolidinoethyl)benzo[de]isoquinoline-1,3-quinone 5-azanyl-2-(2-pyrrolidin-1-ylethyl)benzo[de]isoquinoline-1,3-dione SMR000528909 | cid_328774
Type:
Small organic molecule
Emp. Form.:
C18H19N3O2
Mol. Mass.:
309.3624
SMILES:
Nc1cc2C(=O)N(CCN3CCCC3)C(=O)c3cccc(c1)c23
: