Target
Aryl hydrocarbon receptor
Ligand
BDBM48124
Substrate
Meas. Tech.
Luminescence-based cell-based high throughput dose response assay for activators of the Aryl Hydrocarbon Receptor (AHR)
EC50
12097±n/a nM
Citation
 PubChem, PC Luminescence-based cell-based high throughput dose response assay for activators of the Aryl Hydrocarbon Receptor (AHR) PubChem Bioassay (2010)[AID] 
Target
Name:
Aryl hydrocarbon receptor
Synonyms:
AHR BHLHE76 aryl hydrocarbon receptor precursor
Type:
PROTEIN
Mol. Mass.:
96143.77
Organism:
Homo sapiens (Human)
Description:
ChEMBL_1503828
Residue:
848
  
Inhibitor
Name:
BDBM48124
Synonyms:
(4,8-dimethylquinazolin-2-yl)-[3-(3-morpholinopropyl)-2,4-dihydro-1H-s-triazin-6-yl]amine 4,8-dimethyl-N-[3-[3-(4-morpholinyl)propyl]-2,4-dihydro-1H-1,3,5-triazin-6-yl]-2-quinazolinamine SMR000047283 | cid_666009
Type:
Small organic molecule
Emp. Form.:
C20H29N7O
Mol. Mass.:
383.4906
SMILES:
Cc1cccc2c(C)nc(NC3=NCN(CCCN4CCOCC4)CN3)nc12
: