Target
Aryl hydrocarbon receptor
Ligand
BDBM68469
Substrate
Meas. Tech.
Luminescence-based cell-based high throughput dose response assay for activators of the Aryl Hydrocarbon Receptor (AHR)
EC50
1537±n/a nM
Citation
 PubChem, PC Luminescence-based cell-based high throughput dose response assay for activators of the Aryl Hydrocarbon Receptor (AHR) PubChem Bioassay (2010)[AID] 
Target
Name:
Aryl hydrocarbon receptor
Synonyms:
AHR BHLHE76 aryl hydrocarbon receptor precursor
Type:
PROTEIN
Mol. Mass.:
96143.77
Organism:
Homo sapiens (Human)
Description:
ChEMBL_1503828
Residue:
848
  
Inhibitor
Name:
BDBM68469
Synonyms:
MLS000054003 N-(5-chloro-2-pyridinyl)-2-[(4-methyl-2-thiazolyl)thio]acetamide N-(5-chloropyridin-2-yl)-2-[(4-methyl-1,3-thiazol-2-yl)sulfanyl]acetamide cid_2125057
Type:
Small organic molecule
Emp. Form.:
C11H10ClN3OS2
Mol. Mass.:
299.8
SMILES:
Cc1csc(SCC(=O)Nc2ccc(Cl)cn2)n1
: