Target
Aryl hydrocarbon receptor
Ligand
BDBM75459
Substrate
Meas. Tech.
Luminescence-based cell-based high throughput dose response assay for activators of the Aryl Hydrocarbon Receptor (AHR)
EC50
3246±n/a nM
Citation
 PubChem, PC Luminescence-based cell-based high throughput dose response assay for activators of the Aryl Hydrocarbon Receptor (AHR) PubChem Bioassay (2010)[AID] 
Target
Name:
Aryl hydrocarbon receptor
Synonyms:
AHR BHLHE76 aryl hydrocarbon receptor precursor
Type:
PROTEIN
Mol. Mass.:
96143.77
Organism:
Homo sapiens (Human)
Description:
ChEMBL_1503828
Residue:
848
  
Inhibitor
Name:
BDBM75459
Synonyms:
MLS000114650 N-(2-butyl-5-oxidanylidene-chromeno[3,4-c]pyridin-4-yl)ethanamide N-(2-butyl-5-oxochromeno[3,4-c]pyridin-4-yl)acetamide cid_4606605
Type:
Small organic molecule
Emp. Form.:
C18H18N2O3
Mol. Mass.:
310.3471
SMILES:
CCCCc1cc2c3ccccc3oc(=O)c2c(NC(C)=O)n1
: