Target
Aryl hydrocarbon receptor
Ligand
BDBM75464
Substrate
Meas. Tech.
Luminescence-based cell-based high throughput dose response assay for activators of the Aryl Hydrocarbon Receptor (AHR)
EC50
1088±n/a nM
Citation
 PubChem, PC Luminescence-based cell-based high throughput dose response assay for activators of the Aryl Hydrocarbon Receptor (AHR) PubChem Bioassay (2010)[AID] 
Target
Name:
Aryl hydrocarbon receptor
Synonyms:
AHR BHLHE76 aryl hydrocarbon receptor precursor
Type:
PROTEIN
Mol. Mass.:
96143.77
Organism:
Homo sapiens (Human)
Description:
ChEMBL_1503828
Residue:
848
  
Inhibitor
Name:
BDBM75464
Synonyms:
MLS000549443 N-[2-(4-methylphenyl)-1,3-bis(oxidanylidene)isoindol-4-yl]ethanamide N-[2-(4-methylphenyl)-1,3-dioxo-4-isoindolyl]acetamide SMR000114687 | cid_765586
Type:
Small organic molecule
Emp. Form.:
C17H14N2O3
Mol. Mass.:
294.3047
SMILES:
CC(=O)Nc1cccc2C(=O)N(C(=O)c12)c1ccc(C)cc1
: