Target
Aryl hydrocarbon receptor
Ligand
BDBM75473
Substrate
Meas. Tech.
Luminescence-based cell-based high throughput dose response assay for activators of the Aryl Hydrocarbon Receptor (AHR)
EC50
>91661±n/a nM
Citation
 PubChem, PC Luminescence-based cell-based high throughput dose response assay for activators of the Aryl Hydrocarbon Receptor (AHR) PubChem Bioassay (2010)[AID] 
Target
Name:
Aryl hydrocarbon receptor
Synonyms:
AHR BHLHE76 aryl hydrocarbon receptor precursor
Type:
PROTEIN
Mol. Mass.:
96143.77
Organism:
Homo sapiens (Human)
Description:
ChEMBL_1503828
Residue:
848
  
Inhibitor
Name:
BDBM75473
Synonyms:
MLS000536788 N-[(1-acetylindol-3-yl)methyleneamino]-2,4-dimethyl-thiazole-5-carboxamide N-[(1-ethanoylindol-3-yl)methylideneamino]-2,4-dimethyl-1,3-thiazole-5-carboxamide cid_2337793
Type:
Small organic molecule
Emp. Form.:
C17H16N4O2S
Mol. Mass.:
340.4
SMILES:
CC(=O)n1cc(C=NNC(=O)c2sc(C)nc2C)c2ccccc12
: