Target
Aryl hydrocarbon receptor
Ligand
BDBM75480
Substrate
Meas. Tech.
Luminescence-based cell-based high throughput dose response assay for activators of the Aryl Hydrocarbon Receptor (AHR)
EC50
12291±n/a nM
Citation
 PubChem, PC Luminescence-based cell-based high throughput dose response assay for activators of the Aryl Hydrocarbon Receptor (AHR) PubChem Bioassay (2010)[AID] 
Target
Name:
Aryl hydrocarbon receptor
Synonyms:
AHR BHLHE76 aryl hydrocarbon receptor precursor
Type:
PROTEIN
Mol. Mass.:
96143.77
Organism:
Homo sapiens (Human)
Description:
ChEMBL_1503828
Residue:
848
  
Inhibitor
Name:
BDBM75480
Synonyms:
(4Z)-2-phenyl-4-[(1,3-thiazol-2-ylamino)methylidene]-1,3-oxazol-5-one (4Z)-2-phenyl-4-[(thiazol-2-ylamino)methylene]-2-oxazolin-5-one MLS000591914 cid_5424934
Type:
Small organic molecule
Emp. Form.:
C13H9N3O2S
Mol. Mass.:
271.294
SMILES:
Oc1oc(nc1C=Nc1nccs1)-c1ccccc1
: