Target
Aryl hydrocarbon receptor
Ligand
BDBM75505
Substrate
Meas. Tech.
Luminescence-based cell-based high throughput dose response assay for activators of the Aryl Hydrocarbon Receptor (AHR)
EC50
1173±n/a nM
Citation
 PubChem, PC Luminescence-based cell-based high throughput dose response assay for activators of the Aryl Hydrocarbon Receptor (AHR) PubChem Bioassay (2010)[AID] 
Target
Name:
Aryl hydrocarbon receptor
Synonyms:
AHR BHLHE76 aryl hydrocarbon receptor precursor
Type:
PROTEIN
Mol. Mass.:
96143.77
Organism:
Homo sapiens (Human)
Description:
ChEMBL_1503828
Residue:
848
  
Inhibitor
Name:
BDBM75505
Synonyms:
MLS000696055 N-[1-amino-6-methyl-2-oxo-5-(1H-pyrazol-5-yl)-1,2-dihydro-3-pyridinyl]-4-chlorobenzenecarboxamide N-[1-amino-6-methyl-2-oxo-5-(1H-pyrazol-5-yl)pyridin-3-yl]-4-chlorobenzamide SMR000334966 | cid_1475595
Type:
Small organic molecule
Emp. Form.:
C16H14ClN5O2
Mol. Mass.:
343.768
SMILES:
Cc1c(cc(NC(=O)c2ccc(Cl)cc2)c(=O)n1N)-c1cc[nH]n1
: