Target
Aryl hydrocarbon receptor
Ligand
BDBM75513
Substrate
Meas. Tech.
Luminescence-based cell-based high throughput dose response assay for activators of the Aryl Hydrocarbon Receptor (AHR)
EC50
393.66±n/a nM
Citation
 PubChem, PC Luminescence-based cell-based high throughput dose response assay for activators of the Aryl Hydrocarbon Receptor (AHR) PubChem Bioassay (2010)[AID] 
Target
Name:
Aryl hydrocarbon receptor
Synonyms:
AHR BHLHE76 aryl hydrocarbon receptor precursor
Type:
PROTEIN
Mol. Mass.:
96143.77
Organism:
Homo sapiens (Human)
Description:
ChEMBL_1503828
Residue:
848
  
Inhibitor
Name:
BDBM75513
Synonyms:
3-methoxy-N-(4-methylphenyl)-2-naphthalenecarboxamide 3-methoxy-N-(4-methylphenyl)naphthalene-2-carboxamide MLS001008441 cid_790572
Type:
Small organic molecule
Emp. Form.:
C19H17NO2
Mol. Mass.:
291.3438
SMILES:
COc1cc2ccccc2cc1C(=O)Nc1ccc(C)cc1
: