Target
Aryl hydrocarbon receptor
Ligand
BDBM75533
Substrate
Meas. Tech.
Luminescence-based cell-based high throughput dose response assay for activators of the Aryl Hydrocarbon Receptor (AHR)
EC50
6163±n/a nM
Citation
 PubChem, PC Luminescence-based cell-based high throughput dose response assay for activators of the Aryl Hydrocarbon Receptor (AHR) PubChem Bioassay (2010)[AID] 
Target
Name:
Aryl hydrocarbon receptor
Synonyms:
AHR BHLHE76 aryl hydrocarbon receptor precursor
Type:
PROTEIN
Mol. Mass.:
96143.77
Organism:
Homo sapiens (Human)
Description:
ChEMBL_1503828
Residue:
848
  
Inhibitor
Name:
BDBM75533
Synonyms:
MLS001125581 N-[(7-methoxy-1,3-benzodioxol-5-yl)methylideneamino]-3-pyridinecarboxamide SMR000658951 | cid_768082
Type:
Small organic molecule
Emp. Form.:
C15H13N3O4
Mol. Mass.:
299.2814
SMILES:
COc1cc(C=NNC(=O)c2cccnc2)cc2OCOc12
: