Target
Oxytocin receptor
Ligand
BDBM75537
Substrate
Meas. Tech.
Fluorescence-based cell-based high throughput dose response assay for agonists of the Oxytocin Receptor (OXTR)
EC50
>29908±n/a nM
Citation
 PubChem, PC Fluorescence-based cell-based high throughput dose response assay for agonists of the Oxytocin Receptor (OXTR) PubChem Bioassay (2010)[AID] 
Target
Name:
Oxytocin receptor
Synonyms:
OT-R OXYR_HUMAN | Oxytocin
Type:
Enzyme Catalytic Domain
Mol. Mass.:
42793.26
Organism:
Homo sapiens (Human)
Description:
Oxytocin OXTR HEK293::B2R9L7
Residue:
389
  
Inhibitor
Name:
BDBM75537
Synonyms:
5-amino-N-(2,3-dimethylphenyl)-1-(2-methylbenzyl)-1H-1,2,3-triazole-4-carboxamide 5-amino-N-(2,3-dimethylphenyl)-1-[(2-methylphenyl)methyl]-4-triazolecarboxamide 5-azanyl-N-(2,3-dimethylphenyl)-1-[(2-methylphenyl)methyl]-1,2,3-triazole-4-carboxamide SMR000027949 | cid_3239048
Type:
Small organic molecule
Emp. Form.:
C19H21N5O
Mol. Mass.:
335.4029
SMILES:
Cc1ccccc1Cn1nnc(C(=O)Nc2cccc(C)c2C)c1N
: