Target
Oxytocin receptor
Ligand
BDBM75543
Substrate
Meas. Tech.
Fluorescence-based cell-based high throughput dose response assay for agonists of the Oxytocin Receptor (OXTR)
EC50
>29905±n/a nM
Citation
 PubChem, PC Fluorescence-based cell-based high throughput dose response assay for agonists of the Oxytocin Receptor (OXTR) PubChem Bioassay (2010)[AID] 
Target
Name:
Oxytocin receptor
Synonyms:
OT-R OXYR_HUMAN | Oxytocin
Type:
Enzyme Catalytic Domain
Mol. Mass.:
42793.26
Organism:
Homo sapiens (Human)
Description:
Oxytocin OXTR HEK293::B2R9L7
Residue:
389
  
Inhibitor
Name:
BDBM75543
Synonyms:
2-(4-Methoxy-phenyl)-thiazolidine-3-carbothioic acid (3-chloro-phenyl)-amide N-(3-chlorophenyl)-2-(4-methoxyphenyl)-1,3-thiazolidine-3-carbothioamide N-(3-chlorophenyl)-2-(4-methoxyphenyl)thiazolidine-3-carbothioamide cid_3786957
Type:
Small organic molecule
Emp. Form.:
C17H17ClN2OS2
Mol. Mass.:
364.913
SMILES:
COc1ccc(cc1)C1SCCN1C(=S)Nc1cccc(Cl)c1
: