Target
Oxytocin receptor
Ligand
BDBM75545
Substrate
Meas. Tech.
Fluorescence-based cell-based high throughput dose response assay for agonists of the Oxytocin Receptor (OXTR)
EC50
>29895±n/a nM
Citation
 PubChem, PC Fluorescence-based cell-based high throughput dose response assay for agonists of the Oxytocin Receptor (OXTR) PubChem Bioassay (2010)[AID] 
Target
Name:
Oxytocin receptor
Synonyms:
OT-R OXYR_HUMAN | Oxytocin
Type:
Enzyme Catalytic Domain
Mol. Mass.:
42793.26
Organism:
Homo sapiens (Human)
Description:
Oxytocin OXTR HEK293::B2R9L7
Residue:
389
  
Inhibitor
Name:
BDBM75545
Synonyms:
MLS000662389 N-(1,3-benzodioxol-5-yl)-2-(4-nitrophenyl)propionamide SMR000292910 | cid_2944534
Type:
Small organic molecule
Emp. Form.:
C16H14N2O5
Mol. Mass.:
314.2928
SMILES:
CC(C(=O)Nc1ccc2OCOc2c1)c1ccc(cc1)[N+]([O-])=O
: