Target
Kappa-type opioid receptor
Ligand
BDBM75560
Substrate
Meas. Tech.
SAR analysis of small molecule antagonists of the kappa opioid receptor via a luminescent beta-arrestin assay - Set 4
IC50
20000±n/a nM
Citation
 PubChem, PC SAR analysis of small molecule antagonists of the kappa opioid receptor via a luminescent beta-arrestin assay - Set 4 PubChem Bioassay (2010)[AID] 
Target
Name:
Kappa-type opioid receptor
Synonyms:
K-OR-1 Kappa-opioid receptor (KOR) Kappa-type opioid receptor (KOR) OPIATE Kappa OPRK1 kappa opioid receptor (KOR)
Type:
G Protein-Coupled Receptor (GPCR)
Mol. Mass.:
42648.76
Organism:
Homo sapiens (Human)
Description:
P41145
Residue:
380
  
Inhibitor
Name:
BDBM75560
Synonyms:
4-[[(4-methylphenyl)sulfonylamino]methyl]-N-[2-[2-methylpropyl-(phenylmethyl)amino]ethyl]benzamide KUC104617N N-[2-[benzyl(isobutyl)amino]ethyl]-4-[(tosylamino)methyl]benzamide | cid_44968269
Type:
Small organic molecule
Emp. Form.:
C28H35N3O3S
Mol. Mass.:
493.661
SMILES:
CC(C)CN(CCNC(=O)c1ccc(CNS(=O)(=O)c2ccc(C)cc2)cc1)Cc1ccccc1
: