Target
Kappa-type opioid receptor
Ligand
BDBM75571
Substrate
Meas. Tech.
SAR analysis of small molecule antagonists of the kappa opioid receptor via a luminescent beta-arrestin assay - Set 4
IC50
2660±n/a nM
Citation
 PubChem, PC SAR analysis of small molecule antagonists of the kappa opioid receptor via a luminescent beta-arrestin assay - Set 4 PubChem Bioassay (2010)[AID] 
Target
Name:
Kappa-type opioid receptor
Synonyms:
K-OR-1 Kappa-opioid receptor (KOR) Kappa-type opioid receptor (KOR) OPIATE Kappa OPRK1 kappa opioid receptor (KOR)
Type:
G Protein-Coupled Receptor (GPCR)
Mol. Mass.:
42648.76
Organism:
Homo sapiens (Human)
Description:
P41145
Residue:
380
  
Inhibitor
Name:
BDBM75571
Synonyms:
4-[[(4-tert-butylphenyl)sulfonylamino]methyl]-N-[2-[(phenylmethyl)-propan-2-yl-amino]ethyl]benzamide KSC-11-129-1 N-[2-[benzyl(isopropyl)amino]ethyl]-4-[[(4-tert-butylphenyl)sulfonylamino]methyl]benzamide cid_45115588
Type:
Small organic molecule
Emp. Form.:
C30H39N3O3S
Mol. Mass.:
521.714
SMILES:
CC(C)N(CCNC(=O)c1ccc(CNS(=O)(=O)c2ccc(cc2)C(C)(C)C)cc1)Cc1ccccc1
: