Target
Sphingosine 1-phosphate receptor 4
Ligand
BDBM75595
Substrate
Meas. Tech.
Late-stage fluorescence dose-response cell-based assay to identify agonists of the Sphingosine 1-Phosphate Receptor 4 (S1P4): Synthesized compounds
EC50
>50000±n/a nM
Citation
 PubChem, PC Late-stage fluorescence dose-response cell-based assay to identify agonists of the Sphingosine 1-Phosphate Receptor 4 (S1P4): Synthesized compounds PubChem Bioassay (2010)[AID] 
Target
Name:
Sphingosine 1-phosphate receptor 4
Synonyms:
EDG6 S1P receptor 4 S1P4 S1PR4_HUMAN Sphingosine 1-phosphate receptor Edg-6 sphingosine-1-phosphate 4 S1P4
Type:
G Protein-Coupled Receptor (GPCR)
Mol. Mass.:
41647.39
Organism:
Homo sapiens (Human)
Description:
Residue:
384
  
Inhibitor
Name:
BDBM75595
Synonyms:
3-[3-(2,4-dichlorophenoxy)propoxy]-6-methyl-2-nitro-pyridine 3-[3-[2,4-bis(chloranyl)phenoxy]propoxy]-6-methyl-2-nitro-pyridine SR-02000000297 cid_44620891
Type:
Small organic molecule
Emp. Form.:
C15H14Cl2N2O4
Mol. Mass.:
357.189
SMILES:
Cc1ccc(OCCCOc2ccc(Cl)cc2Cl)c(n1)[N+]([O-])=O
: