Target
Vasopressin V1a receptor
Ligand
BDBM75554
Substrate
Meas. Tech.
Counterscreen for Oxytocin Receptor (OXTR) agonists: Fluorescence-based cell-based high throughput dose response assay to identify agonists of the vasopressin 1 receptor (V1R)
EC50
2325±n/a nM
Citation
 PubChem, PC Counterscreen for Oxytocin Receptor (OXTR) agonists: Fluorescence-based cell-based high throughput dose response assay to identify agonists of the vasopressin 1 receptor (V1R) PubChem Bioassay (2010)[AID] 
Target
Name:
Vasopressin V1a receptor
Synonyms:
AVPR V1a AVPR1A V1AR_HUMAN VASOPRESSIN V1A Vasopressin V1 receptor Vasopressin receptor
Type:
Receptor
Mol. Mass.:
46820.18
Organism:
Homo sapiens (Human)
Description:
P37288
Residue:
418
  
Inhibitor
Name:
BDBM75554
Synonyms:
(4aR,5R,6aS,6bR,10S,12aR)-2,2,6a,6b,9,9,12a-heptamethyl-5,10-bis(oxidanyl)-1,3,4,5,6,6a,7,8,8a,10,11,12,13,14b-tetradecahydropicene-4a-carboxylic acid MLS002473143 cid_23983726 | echinocystic aicd
Type:
Small organic molecule
Emp. Form.:
C30H48O4
Mol. Mass.:
472.6997
SMILES:
CC1(C)CC[C@@]2([C@H](O)C[C@]3(C)C(=CCC4[C@@]5(C)CC[C@H](O)C(C)(C)C5CC[C@@]34C)C2C1)C(O)=O
: