Target
Sphingosine 1-phosphate receptor 1
Ligand
BDBM75604
Substrate
Meas. Tech.
Late-stage fluorescence-based dose-response cell-based assay to identify agonists of the Sphingosine 1-Phosphate Receptor 4 (S1P4): Sphingosine 1-Phosphate Receptor 1 (S1P1) counterscreen assay
EC50
>50000±n/a nM
Citation
 PubChem, PC Late-stage fluorescence-based dose-response cell-based assay to identify agonists of the Sphingosine 1-Phosphate Receptor 4 (S1P4): Sphingosine 1-Phosphate Receptor 1 (S1P1) counterscreen assay PubChem Bioassay (2010)[AID] 
Target
Name:
Sphingosine 1-phosphate receptor 1
Synonyms:
CHEDG1 Endothelial differentiation G-protein coupled receptor 1 S1P1 S1PR1_HUMAN Sphingosine 1-phosphate receptor Edg-1
Type:
Enzyme
Mol. Mass.:
42836.02
Organism:
Homo sapiens (Human)
Description:
P21453
Residue:
382
  
Inhibitor
Name:
BDBM75604
Synonyms:
2-bromo-3-[2-(2,4-dichlorophenoxy)ethoxy]-6-methyl-pyridine 3-[2-[2,4-bis(chloranyl)phenoxy]ethoxy]-2-bromanyl-6-methyl-pyridine SR-02000000306 cid_44620895
Type:
Small organic molecule
Emp. Form.:
C14H12BrCl2NO2
Mol. Mass.:
377.061
SMILES:
Cc1ccc(OCCOc2ccc(Cl)cc2Cl)c(Br)n1
: