Target
Intestinal-type alkaline phosphatase
Ligand
BDBM75609
Substrate
Meas. Tech.
Dose Response concentration confirmation of uHTS hits from a small molecule activators of human intestinal alkaline phosphatase via a luminescent assay
EC50
>100000±n/a nM
Citation
 PubChem, PC Dose Response concentration confirmation of uHTS hits from a small molecule activators of human intestinal alkaline phosphatase via a luminescent assay PubChem Bioassay (2010)[AID] 
Target
Name:
Intestinal-type alkaline phosphatase
Synonyms:
ALPI Intestinal alkaline phosphatase | PPBI_HUMAN
Type:
PROTEIN
Mol. Mass.:
56804.94
Organism:
Homo sapiens (Human)
Description:
ChEMBL_1278525
Residue:
528
  
Inhibitor
Name:
BDBM75609
Synonyms:
3,4-dihydro-2H-pyrimido[2,1-b][1,3]benzothiazol-3-ol SMR000039049 | cid_658141
Type:
Small organic molecule
Emp. Form.:
C10H10N2OS
Mol. Mass.:
206.264
SMILES:
OC1CN=C2Sc3ccccc3N2C1
: