Target
Intestinal-type alkaline phosphatase
Ligand
BDBM75648
Substrate
Meas. Tech.
Dose Response concentration confirmation of uHTS hits from a small molecule activators of human intestinal alkaline phosphatase via a luminescent assay
EC50
29100±n/a nM
Citation
 PubChem, PC Dose Response concentration confirmation of uHTS hits from a small molecule activators of human intestinal alkaline phosphatase via a luminescent assay PubChem Bioassay (2010)[AID] 
Target
Name:
Intestinal-type alkaline phosphatase
Synonyms:
ALPI Intestinal alkaline phosphatase | PPBI_HUMAN
Type:
PROTEIN
Mol. Mass.:
56804.94
Organism:
Homo sapiens (Human)
Description:
ChEMBL_1278525
Residue:
528
  
Inhibitor
Name:
BDBM75648
Synonyms:
1-N'-[(Z)-(3-ethoxy-4-oxocyclohexa-2,5-dien-1-ylidene)methyl]-2-N'-[(E)-(3-ethoxy-4-oxocyclohexa-2,5-dien-1-ylidene)methyl]ethanedihydrazide N'~1~,N'~2~-bis(3-ethoxy-4-hydroxybenzylidene)ethanedihydrazide N1'-[(Z)-(3-ethoxy-4-oxidanylidene-cyclohexa-2,5-dien-1-ylidene)methyl]-N2'-[(E)-(3-ethoxy-4-oxidanylidene-cyclohexa-2,5-dien-1-ylidene)methyl]ethanedihydrazide SMR000496583 | cid_5334246
Type:
Small organic molecule
Emp. Form.:
C20H22N4O6
Mol. Mass.:
414.4119
SMILES:
CCOc1cc(C=NNC(=O)C(=O)NN=Cc2ccc(O)c(OCC)c2)ccc1O
: