Target
Intestinal-type alkaline phosphatase
Ligand
BDBM75664
Substrate
Meas. Tech.
Dose Response concentration confirmation of uHTS hits from a small molecule activators of human intestinal alkaline phosphatase via a luminescent assay
EC50
74000±n/a nM
Citation
 PubChem, PC Dose Response concentration confirmation of uHTS hits from a small molecule activators of human intestinal alkaline phosphatase via a luminescent assay PubChem Bioassay (2010)[AID] 
Target
Name:
Intestinal-type alkaline phosphatase
Synonyms:
ALPI Intestinal alkaline phosphatase | PPBI_HUMAN
Type:
PROTEIN
Mol. Mass.:
56804.94
Organism:
Homo sapiens (Human)
Description:
ChEMBL_1278525
Residue:
528
  
Inhibitor
Name:
BDBM75664
Synonyms:
MLS001083067 N-[2-[1-[(2-methoxyphenyl)methyl]-4-piperidinyl]-3-pyrazolyl]-4-phenylbutanamide N-[2-[1-[(2-methoxyphenyl)methyl]piperidin-4-yl]pyrazol-3-yl]-4-phenylbutanamide cid_24790576
Type:
Small organic molecule
Emp. Form.:
C26H32N4O2
Mol. Mass.:
432.5579
SMILES:
COc1ccccc1CN1CCC(CC1)n1nccc1NC(=O)CCCc1ccccc1
: