Target
Intestinal-type alkaline phosphatase
Ligand
BDBM65665
Substrate
Meas. Tech.
Dose Response concentration confirmation of uHTS hits from a small molecule activators of human intestinal alkaline phosphatase via a luminescent assay
EC50
12100±n/a nM
Citation
 PubChem, PC Dose Response concentration confirmation of uHTS hits from a small molecule activators of human intestinal alkaline phosphatase via a luminescent assay PubChem Bioassay (2010)[AID] 
Target
Name:
Intestinal-type alkaline phosphatase
Synonyms:
ALPI Intestinal alkaline phosphatase | PPBI_HUMAN
Type:
PROTEIN
Mol. Mass.:
56804.94
Organism:
Homo sapiens (Human)
Description:
ChEMBL_1278525
Residue:
528
  
Inhibitor
Name:
BDBM65665
Synonyms:
1-[(2-bromobenzoyl)amino]-3-cyclohexyl-thiourea 1-[(2-bromophenyl)carbonylamino]-3-cyclohexyl-thiourea MLS001075515 cid_1929796
Type:
Small organic molecule
Emp. Form.:
C14H18BrN3OS
Mol. Mass.:
356.281
SMILES:
Brc1ccccc1C(=O)NNC(=S)NC1CCCCC1
: