Target
Intestinal-type alkaline phosphatase
Ligand
BDBM75677
Substrate
Meas. Tech.
Dose Response concentration confirmation of uHTS hits from a small molecule activators of human intestinal alkaline phosphatase via a luminescent assay
EC50
9620±n/a nM
Citation
 PubChem, PC Dose Response concentration confirmation of uHTS hits from a small molecule activators of human intestinal alkaline phosphatase via a luminescent assay PubChem Bioassay (2010)[AID] 
Target
Name:
Intestinal-type alkaline phosphatase
Synonyms:
ALPI Intestinal alkaline phosphatase | PPBI_HUMAN
Type:
PROTEIN
Mol. Mass.:
56804.94
Organism:
Homo sapiens (Human)
Description:
ChEMBL_1278525
Residue:
528
  
Inhibitor
Name:
BDBM75677
Synonyms:
1-[(2-bromobenzoyl)amino]-3-(2-furfuryl)thiourea 1-[(2-bromophenyl)carbonylamino]-3-(furan-2-ylmethyl)thiourea MLS001123862 cid_1965046
Type:
Small organic molecule
Emp. Form.:
C13H12BrN3O2S
Mol. Mass.:
354.222
SMILES:
Brc1ccccc1C(=O)NNC(=S)NCc1ccco1
: