Target
Intestinal-type alkaline phosphatase
Ligand
BDBM75696
Substrate
Meas. Tech.
Dose Response concentration confirmation of uHTS hits from a small molecule activators of human intestinal alkaline phosphatase via a luminescent assay
EC50
8740±n/a nM
Citation
 PubChem, PC Dose Response concentration confirmation of uHTS hits from a small molecule activators of human intestinal alkaline phosphatase via a luminescent assay PubChem Bioassay (2010)[AID] 
Target
Name:
Intestinal-type alkaline phosphatase
Synonyms:
ALPI Intestinal alkaline phosphatase | PPBI_HUMAN
Type:
PROTEIN
Mol. Mass.:
56804.94
Organism:
Homo sapiens (Human)
Description:
ChEMBL_1278525
Residue:
528
  
Inhibitor
Name:
BDBM75696
Synonyms:
1-[3-(dimethylsulfamoyl)phenyl]-3-[(3-hydroxy-2-naphthoyl)amino]thiourea 1-[3-(dimethylsulfamoyl)phenyl]-3-[(3-oxidanylnaphthalen-2-yl)carbonylamino]thiourea MLS002166483 cid_4848262
Type:
Small organic molecule
Emp. Form.:
C20H20N4O4S2
Mol. Mass.:
444.527
SMILES:
CN(C)S(=O)(=O)c1cccc(NC(=S)NNC(=O)c2cc3ccccc3cc2O)c1
: