Target
Sphingosine 1-phosphate receptor 3
Ligand
BDBM75601
Substrate
Meas. Tech.
Late-stage fluorescence-based dose-response cell-based assay to identify agonists of the Sphingosine 1-Phosphate Receptor 4 (S1P4): Sphingosine 1-Phosphate Receptor 3 (S1P3) counterscreen assay
EC50
>50000±n/a nM
Citation
 PubChem, PC Late-stage fluorescence-based dose-response cell-based assay to identify agonists of the Sphingosine 1-Phosphate Receptor 4 (S1P4): Sphingosine 1-Phosphate Receptor 3 (S1P3) counterscreen assay PubChem Bioassay (2010)[AID] 
Target
Name:
Sphingosine 1-phosphate receptor 3
Synonyms:
C9orf108 EDG3 S1P receptor 3 S1P3 S1PR3_HUMAN Sphingosine 1-phosphate receptor 3 (S1P3) | Sphingosine 1-phosphate receptor Edg-3
Type:
G Protein-Coupled Receptor (GPCR)
Mol. Mass.:
42278.13
Organism:
Homo sapiens (Human)
Description:
Q99500
Residue:
378
  
Inhibitor
Name:
BDBM75601
Synonyms:
6-methyl-2-nitro-3-[2-(2,4,6-trichlorophenoxy)ethoxy]pyridine CYM50174 SR-02000000303-1 | cid_44620882
Type:
Small organic molecule
Emp. Form.:
C14H11Cl3N2O4
Mol. Mass.:
377.607
SMILES:
Cc1ccc(OCCOc2c(Cl)cc(Cl)cc2Cl)c(n1)[N+]([O-])=O
: