Target
Oxytocin receptor
Ligand
BDBM75709
Substrate
Meas. Tech.
Fluorescence-based cell-based high throughput dose response assay for potentiators of Oxytocin Receptor (OXTR)
EC50
>29898±n/a nM
Citation
 PubChem, PC Fluorescence-based cell-based high throughput dose response assay for potentiators of Oxytocin Receptor (OXTR) PubChem Bioassay (2010)[AID] 
Target
Name:
Oxytocin receptor
Synonyms:
OT-R OXYR_HUMAN | Oxytocin
Type:
Enzyme Catalytic Domain
Mol. Mass.:
42793.26
Organism:
Homo sapiens (Human)
Description:
Oxytocin OXTR HEK293::B2R9L7
Residue:
389
  
Inhibitor
Name:
BDBM75709
Synonyms:
4-[(1,3-diphenyl-4-pyrazolyl)methylideneamino]-3-pyridin-4-yl-1H-1,2,4-triazole-5-thione 4-[(1,3-diphenylpyrazol-4-yl)methylideneamino]-3-pyridin-4-yl-1H-1,2,4-triazole-5-thione MLS000858724 cid_2815100
Type:
Small organic molecule
Emp. Form.:
C23H17N7S
Mol. Mass.:
423.493
SMILES:
S=c1[nH]nc(-c2ccncc2)n1N=Cc1cn(nc1-c1ccccc1)-c1ccccc1
: