Target
Vasopressin V1a receptor
Ligand
BDBM75715
Substrate
Meas. Tech.
Fluorescence-based cell-based high throughput dose response screening assay for agonists of the vasopressin 1 receptor (V1R)
EC50
6678±n/a nM
Citation
 PubChem, PC Fluorescence-based cell-based high throughput dose response screening assay for agonists of the vasopressin 1 receptor (V1R) PubChem Bioassay (2010)[AID] 
Target
Name:
Vasopressin V1a receptor
Synonyms:
AVPR V1a AVPR1A V1AR_HUMAN VASOPRESSIN V1A Vasopressin V1 receptor Vasopressin receptor
Type:
Receptor
Mol. Mass.:
46820.18
Organism:
Homo sapiens (Human)
Description:
P37288
Residue:
418
  
Inhibitor
Name:
BDBM75715
Synonyms:
6-bromanyl-2-(3-chlorophenyl)-3-oxidanyl-quinazolin-4-one 6-bromo-2-(3-chlorophenyl)-3-hydroxy-4-quinazolinone 6-bromo-2-(3-chlorophenyl)-3-hydroxyquinazolin-4-one SMR000549804 | cid_1471100
Type:
Small organic molecule
Emp. Form.:
C14H8BrClN2O2
Mol. Mass.:
351.583
SMILES:
On1c(nc2ccc(Br)cc2c1=O)-c1cccc(Cl)c1
: