Target
Oxytocin receptor
Ligand
BDBM52365
Substrate
Meas. Tech.
Counterscreen for vasopressin 1 receptor (V1R) agonists: Fluorescence-based cell-based high throughput dose response assay for agonists of the Oxytocin Receptor (OXTR)
EC50
>3323±n/a nM
Citation
 PubChem, PC Counterscreen for vasopressin 1 receptor (V1R) agonists: Fluorescence-based cell-based high throughput dose response assay for agonists of the Oxytocin Receptor (OXTR) PubChem Bioassay (2010)[AID] 
Target
Name:
Oxytocin receptor
Synonyms:
OT-R OXYR_HUMAN | Oxytocin
Type:
Enzyme Catalytic Domain
Mol. Mass.:
42793.26
Organism:
Homo sapiens (Human)
Description:
Oxytocin OXTR HEK293::B2R9L7
Residue:
389
  
Inhibitor
Name:
BDBM52365
Synonyms:
2-(2-Hydroxy-ethyl)-6-piperidin-1-yl-benzo[de]isoquinoline-1,3-dione 2-(2-hydroxyethyl)-6-piperidin-1-yl-benzo[de]isoquinoline-1,3-dione 2-(2-hydroxyethyl)-6-piperidino-benzo[de]isoquinoline-1,3-quinone SMR000176434 | cid_2871994
Type:
Small organic molecule
Emp. Form.:
C19H20N2O3
Mol. Mass.:
324.3737
SMILES:
OCCN1C(=O)c2cccc3c(ccc(C1=O)c23)N1CCCCC1
: