Target
Oxytocin receptor
Ligand
BDBM4810
Substrate
Meas. Tech.
Counterscreen for vasopressin 1 receptor (V1R) agonists: Fluorescence-based cell-based high throughput dose response assay for agonists of the Oxytocin Receptor (OXTR)
EC50
11468±n/a nM
Citation
 PubChem, PC Counterscreen for vasopressin 1 receptor (V1R) agonists: Fluorescence-based cell-based high throughput dose response assay for agonists of the Oxytocin Receptor (OXTR) PubChem Bioassay (2010)[AID] 
Target
Name:
Oxytocin receptor
Synonyms:
OT-R OXYR_HUMAN | Oxytocin
Type:
Enzyme Catalytic Domain
Mol. Mass.:
42793.26
Organism:
Homo sapiens (Human)
Description:
Oxytocin OXTR HEK293::B2R9L7
Residue:
389
  
Inhibitor
Name:
BDBM4810
Synonyms:
(3Z)-3-[(3,5-dimethyl-1H-pyrrol-2-yl)methylidene]-2,3-dihydro-1H-indol-2-one CHEMBL276711 SU5416 US10189853, semaxanib US9422297, SU5416 | cid_5329098
Type:
Small organic molecule
Emp. Form.:
C15H14N2O
Mol. Mass.:
238.2845
SMILES:
Cc1cc(C)c(\C=C2/C(=O)Nc3ccccc23)[nH]1
: