Target
Intestinal-type alkaline phosphatase
Ligand
BDBM49406
Substrate
Meas. Tech.
Dose Response confirmation of uHTS hits from a small molecule inhibitors of human intestinal alkaline phosphatase via a luminescent assay
IC50
>100000±n/a nM
Citation
 PubChem, PC Dose Response confirmation of uHTS hits from a small molecule inhibitors of human intestinal alkaline phosphatase via a luminescent assay PubChem Bioassay (2010)[AID] 
Target
Name:
Intestinal-type alkaline phosphatase
Synonyms:
ALPI Intestinal alkaline phosphatase | PPBI_HUMAN
Type:
PROTEIN
Mol. Mass.:
56804.94
Organism:
Homo sapiens (Human)
Description:
ChEMBL_1278525
Residue:
528
  
Inhibitor
Name:
BDBM49406
Synonyms:
3-(4-methoxyphenyl)-6-methyl-2H-1,4-benzoxazine SMR000125868 methyl 4-(6-methyl-2H-1,4-benzoxazin-3-yl)phenyl ether
Type:
Small organic molecule
Emp. Form.:
C16H15NO2
Mol. Mass.:
253.2958
SMILES:
COc1ccc(cc1)C1=Nc2cc(C)ccc2OC1
: