Target
Intestinal-type alkaline phosphatase
Ligand
BDBM75734
Substrate
Meas. Tech.
Dose Response confirmation of uHTS hits from a small molecule inhibitors of human intestinal alkaline phosphatase via a luminescent assay
IC50
>100000±n/a nM
Citation
 PubChem, PC Dose Response confirmation of uHTS hits from a small molecule inhibitors of human intestinal alkaline phosphatase via a luminescent assay PubChem Bioassay (2010)[AID] 
Target
Name:
Intestinal-type alkaline phosphatase
Synonyms:
ALPI Intestinal alkaline phosphatase | PPBI_HUMAN
Type:
PROTEIN
Mol. Mass.:
56804.94
Organism:
Homo sapiens (Human)
Description:
ChEMBL_1278525
Residue:
528
  
Inhibitor
Name:
BDBM75734
Synonyms:
5-cyano-6-(2-methoxyphenoxy)-2-methyl-3-pyridinecarboxylic acid methyl ester MLS000326003 cid_1471663 methyl 5-cyano-6-(2-methoxyphenoxy)-2-methylnicotinate | methyl 5-cyano-6-(2-methoxyphenoxy)-2-methylpyridine-3-carboxylate
Type:
Small organic molecule
Emp. Form.:
C16H14N2O4
Mol. Mass.:
298.2934
SMILES:
COC(=O)c1cc(C#N)c(Oc2ccccc2OC)nc1C
: